Target
Lipoxygenase
Ligand
BDBM50025867
Substrate
Meas. Tech.
ChEMBL_1437404 (CHEMBL3386626)
IC50
60000±n/a nM
Citation
 Pavic, KPerkovic, ICindric, MPranjic, MMartin-Kleiner, IKralj, MSchols, DHadjipavlou-Litina, DKatsori, AMZorc, B Novel semicarbazides and ureas of primaquine with bulky aryl or hydroxyalkyl substituents: synthesis, cytostatic and antioxidative activity. Eur J Med Chem 86:502-14 (2014)  
Target
Name:
Lipoxygenase
Synonyms:
Type:
PROTEIN
Mol. Mass.:
1886.07
Organism:
Glycine max
Description:
ChEMBL_103841
Residue:
18
PNSEEGLTCRGIPNSISI
  
Inhibitor
Name:
BDBM50025867
Synonyms:
CHEMBL3330912
Type:
Small organic molecule
Emp. Form.:
C31H35N5O4
Mol. Mass.:
541.6407
SMILES:
[#6]-[#8]-c1ccc(cc1)-[#6](=[#7]\[#7]-[#6](=O)-[#7]-[#6]-[#6]-[#6]-[#6](-[#6])-[#7]-c1cc(-[#8]-[#6])cc2cccnc12)\c1ccc(-[#8]-[#6])cc1
: