Target
Histamine H3 receptor
Ligand
BDBM50247053
Substrate
Meas. Tech.
ChEMBL_1432176 (CHEMBL3390512)
Ki
11±n/a nM
Citation
 Lipani, LOdadzic, DWeizel, LSchwed, JSSadek, BStark, H Studies on molecular properties prediction and histamine H3 receptor affinities of novel ligands with uracil-based motifs. Eur J Med Chem 86:578-88 (2014)  
Target
Name:
Histamine H3 receptor
Synonyms:
G-protein coupled receptor 97 HH3R HRH3 Histamine H3 receptor (H3) Histamine receptor (H3 and H4)
Type:
G Protein-Coupled Receptor (GPCR)
Mol. Mass.:
48691.47
Organism:
Homo sapiens (Human)
Description:
Binding assays were using CHO cells stably expressing hH3R receptors.
Residue:
445
  
Inhibitor
Name:
BDBM50247053
Synonyms:
1-(3-(3-(4-chlorophenyl)propoxy)propyl)piperidine Tiprolisant
Type:
Small organic molecule
Emp. Form.:
C17H26ClNO
Mol. Mass.:
295.847
SMILES:
Clc1ccc(CCCOCCCN2CCCCC2)cc1
: