Target
1,25-dihydroxyvitamin D(3) 24-hydroxylase, mitochondrial
Ligand
BDBM31768
Substrate
Meas. Tech.
ChEMBL_1435383 (CHEMBL3383457)
Ki
35±n/a nM
Citation
 Ferla, SGomaa, MSBrancale, AZhu, JOchalek, JTDeLuca, HFSimons, C Novel styryl-indoles as small molecule inhibitors of 25-hydroxyvitamin D-24-hydroxylase (CYP24A1): Synthesis and biological evaluation. Eur J Med Chem 87:39-51 (2014)  
Target
Name:
1,25-dihydroxyvitamin D(3) 24-hydroxylase, mitochondrial
Synonyms:
1,25-dihydroxyvitamin D(3) 24-hydroxylase, mitochondrial CYP24 Cytochrome P450 24A1
Type:
Protein
Mol. Mass.:
58889.66
Organism:
Homo sapiens (Human)
Description:
Q07973
Residue:
514
  
Inhibitor
Name:
BDBM31768
Synonyms:
CHEMBL295698 Nizoral | Panfungol
Type:
Small organic molecule
Emp. Form.:
C26H28Cl2N4O4
Mol. Mass.:
531.431
SMILES:
CC(=O)N1CCN(CC1)c1ccc(OC[C@@H]2CO[C@](Cn3ccnc3)(O2)c2ccc(Cl)cc2Cl)cc1
: