Target
Orexin receptor type 2
Ligand
BDBM50028040
Substrate
Meas. Tech.
ChEMBL_1433179 (CHEMBL3387579)
Ki
0.300000±n/a nM
Citation
 Roecker, AJReger, TSMattern, MCMercer, SPBergman, JMSchreier, JDCube, RVCox, CDLi, DLemaire, WBruno, JGHarrell, CMGarson, SLGotter, ALFox, SVStevens, JTannenbaum, PLPrueksaritanont, TCabalu, TDCui, DStellabott, JHartman, GDYoung, SDWinrow, CJRenger, JJColeman, PJ Discovery of MK-3697: a selective orexin 2 receptor antagonist (2-SORA) for the treatment of insomnia. Bioorg Med Chem Lett 24:4884-90 (2014)  
Target
Name:
Orexin receptor type 2
Synonyms:
HCRTR2 OX2R_HUMAN Orexin receptor type 2 (OR-2) Orexin receptor type 2 (OX2R) Ox-2-R | Ox2-R
Type:
Protein
Mol. Mass.:
50710.53
Organism:
Homo sapiens (Human)
Description:
O43614
Residue:
444
  
Inhibitor
Name:
BDBM50028040
Synonyms:
CHEMBL3338846
Type:
Small organic molecule
Emp. Form.:
C26H24N4O3
Mol. Mass.:
440.4938
SMILES:
COc1ccc(CNC(=O)c2cc(cnc2-c2ccccc2)-c2cncc(C)c2)nc1OC
: