Target
Orexin/Hypocretin receptor type 1
Ligand
BDBM106971
Substrate
Meas. Tech.
ChEMBL_1433180 (CHEMBL3387580)
Ki
3600±n/a nM
Citation
 Roecker, AJReger, TSMattern, MCMercer, SPBergman, JMSchreier, JDCube, RVCox, CDLi, DLemaire, WBruno, JGHarrell, CMGarson, SLGotter, ALFox, SVStevens, JTannenbaum, PLPrueksaritanont, TCabalu, TDCui, DStellabott, JHartman, GDYoung, SDWinrow, CJRenger, JJColeman, PJ Discovery of MK-3697: a selective orexin 2 receptor antagonist (2-SORA) for the treatment of insomnia. Bioorg Med Chem Lett 24:4884-90 (2014)  
Target
Name:
Orexin/Hypocretin receptor type 1
Synonyms:
HCRTR1 OX1R_HUMAN Orexin receptor type 1 (OR 1) Orexin receptor type 1 (OX1) Orexin receptor type 1 (OxR1) | Ox1r
Type:
Protein
Mol. Mass.:
47554.50
Organism:
Homo sapiens (Human)
Description:
O43613
Residue:
425
  
Inhibitor
Name:
BDBM106971
Synonyms:
US8592457, 7-5
Type:
Small organic molecule
Emp. Form.:
C23H21N5O3S
Mol. Mass.:
447.51
SMILES:
COc1ccc(CNC(=O)c2cc(ncc2-c2nccs2)-c2cncc(C)c2)nc1OC
: