Target
Potassium voltage-gated channel subfamily H member 2
Ligand
BDBM50029668
Substrate
Meas. Tech.
ChEMBL_1436969 (CHEMBL3389028)
IC50
16200±n/a nM
Citation
 Finlay, MRAnderton, MAshton, SBallard, PBethel, PABox, MRBradbury, RHBrown, SJButterworth, SCampbell, AChorley, CColclough, NCross, DACurrie, GSGrist, MHassall, LHill, GBJames, DJames, MKemmitt, PKlinowska, TLamont, GLamont, SGMartin, NMcFarland, HLMellor, MJOrme, JPPerkins, DPerkins, PRichmond, GSmith, PWard, RAWaring, MJWhittaker, DWells, SWrigley, GL Discovery of a potent and selective EGFR inhibitor (AZD9291) of both sensitizing and T790M resistance mutations that spares the wild type form of the receptor. J Med Chem 57:8249-67 (2014)  
Target
Name:
Potassium voltage-gated channel subfamily H member 2
Synonyms:
1,3-beta-glucan synthase component GLS2 ERG Eag-related protein 1 Ether-a-go-go-related gene (HERG) Ether-a-go-go-related gene potassium channel 1 Ether-a-go-go-related gene potassium channel 1 (hERG1) Ether-a-go-go-related protein 1 H-ERG KCNH2 Potassium voltage-gated channel subfamily H member 2 (hERG) Voltage-gated potassium channel subunit Kv11.1 hERG Potassium Channel 1 | putative potassium channel subunit
Type:
Multi-pass membrane protein
Mol. Mass.:
126672.65
Organism:
Homo sapiens (Human)
Description:
Q12809
Residue:
1159
  
Inhibitor
Name:
BDBM50029668
Synonyms:
AZD-9291 US10085983, Compound AZD-9291 US11111233, Example AZD9291 US9890168, Compound AZD-9291 | WO2022090481, Example osimertinib
Type:
Small organic molecule
Emp. Form.:
C28H33N7O2
Mol. Mass.:
499.6073
SMILES:
COc1cc(N(C)CCN(C)C)c(NC(=O)C=C)cc1Nc1nccc(n1)-c1cn(C)c2ccccc12
: