Target
Nuclear receptor ROR-gamma
Ligand
BDBM50445877
Substrate
Meas. Tech.
ChEMBL_1434910 (CHEMBL3385304)
IC50
20±n/a nM
Citation
 Gege, CSchlüter, THoffmann, T Identification of the first inverse agonist of retinoid-related orphan receptor (ROR) with dual selectivity for RORß and ROR¿t. Bioorg Med Chem Lett 24:5265-7 (2014)  
Target
Name:
Nuclear receptor ROR-gamma
Synonyms:
NR1F3 Nuclear receptor ROR-gamma (RORC) RAR-related orphan receptor C (RORc) RORG RZRG Retinoid-related orphan receptor-gamma (RORc)
Type:
Enzyme Catalytic Domain
Mol. Mass.:
58218.40
Organism:
Homo sapiens (Human)
Description:
P51449
Residue:
518
  
Inhibitor
Name:
BDBM50445877
Synonyms:
CHEMBL3105681
Type:
Small organic molecule
Emp. Form.:
C26H20Cl2N2O4S2
Mol. Mass.:
559.484
SMILES:
CCS(=O)(=O)c1ccc(CC(=O)Nc2nc(c(s2)C(=O)c2ccccc2Cl)-c2cccc(Cl)c2)cc1
: