Target
Nuclear receptor ROR-alpha
Ligand
BDBM19993
Substrate
Meas. Tech.
ChEMBL_1434917 (CHEMBL3385311)
IC50
<5012±n/a nM
Citation
 Gege, CSchlüter, THoffmann, T Identification of the first inverse agonist of retinoid-related orphan receptor (ROR) with dual selectivity for RORß and ROR¿t. Bioorg Med Chem Lett 24:5265-7 (2014)  
Target
Name:
Nuclear receptor ROR-alpha
Synonyms:
NR1F1 Nuclear receptor subfamily 1 group F member 1 RORA RZRA | Retinoid-related orphan receptor-alpha
Type:
PROTEIN
Mol. Mass.:
58976.26
Organism:
Homo sapiens (Human)
Description:
ChEMBL_101591
Residue:
523
  
Inhibitor
Name:
BDBM19993
Synonyms:
CHEMBL62136 T 0901317 TO-901317 US10669296, Compound TO901317 [3H]T0901317
Type:
Small organic molecule
Emp. Form.:
C17H12F9NO3S
Mol. Mass.:
481.333
SMILES:
OC(c1ccc(cc1)N(CC(F)(F)F)S(=O)(=O)c1ccccc1)(C(F)(F)F)C(F)(F)F
: