Target
Vitamin D3 receptor
Ligand
BDBM50030475
Substrate
Meas. Tech.
ChEMBL_1434935 (CHEMBL3385872)
EC50
0.210000±n/a nM
Citation
 Gege, CSchlüter, THoffmann, T Identification of the first inverse agonist of retinoid-related orphan receptor (ROR) with dual selectivity for RORß and ROR¿t. Bioorg Med Chem Lett 24:5265-7 (2014)  
Target
Name:
Vitamin D3 receptor
Synonyms:
1,25-dihydroxyvitamin D3 receptor Nuclear receptor subfamily 1 group I member 1 VDR | VDR_HUMAN
Type:
Protein
Mol. Mass.:
48288.72
Organism:
Homo sapiens (Human)
Description:
P11473
Residue:
427
  
Inhibitor
Name:
BDBM50030475
Synonyms:
7-Dehydrocholesterol Cholecalciferol Dihydrocholesterol Vitamin D 3
Type:
Small organic molecule
Emp. Form.:
C27H44O
Mol. Mass.:
384.6377
SMILES:
[H][C@@]1(CC[C@@]2([H])\C(CCC[C@]12C)=C\C=C1\C[C@@H](O)CCC1=C)[C@H](C)CCCC(C)C
: