Target
Type-2 angiotensin II receptor
Ligand
BDBM50156173
Substrate
Meas. Tech.
ChEMBL_1438528 (CHEMBL3385518)
Ki
0.400000±n/a nM
Citation
 Guimond, MOHallberg, MGallo-Payet, NWallinder, C Saralasin and Sarile Are AT2 Receptor Agonists. ACS Med Chem Lett 5:1129-32 (2014)  
Target
Name:
Type-2 angiotensin II receptor
Synonyms:
AGTR2 AT2 Angiotensin II type 2 (AT-2) receptor Type-2 angiotensin II receptor
Type:
Enzyme Catalytic Domain
Mol. Mass.:
41201.61
Organism:
Homo sapiens (Human)
Description:
Angiotensin II, central 0 0::P50052
Residue:
363
  
Inhibitor
Name:
BDBM50156173
Synonyms:
(1-((2'-(1H-tetrazol-5-yl)biphenyl-4-yl)methyl)-2-butyl-4-chloro-1H-imidazol-5-yl)methanol butyl (5-isobutylthien-2-yl)sulfonylcarbamate derivative | butyl 3-(4-((1H-imidazol-1-yl)methyl)phenyl)-5-isobutylthiophen-2-ylsulfonylcarbamate
Type:
Small organic molecule
Emp. Form.:
C23H29N3O4S2
Mol. Mass.:
475.624
SMILES:
CCCCOC(=O)NS(=O)(=O)c1sc(CC(C)C)cc1-c1ccc(Cn2ccnc2)cc1
: