Target
Carbonic anhydrase 12
Ligand
BDBM50429900
Substrate
Meas. Tech.
ChEMBL_1441644 (CHEMBL3377090)
Kd
250±n/a nM
Target
Name:
Carbonic anhydrase 12
Synonyms:
CA-XII CAH12_HUMAN Carbonic anhydrase Carbonic anhydrase XII Carbonic anhydrase XII (CAXII) | Tumor antigen HOM-RCC-3.1.3
Type:
Enzyme
Mol. Mass.:
39456.00
Organism:
Homo sapiens (Human)
Description:
Catalytic domain of human cloned isozyme was used in the assay
Residue:
354
  
Inhibitor
Name:
BDBM50429900
Synonyms:
CHEMBL2333417
Type:
Small organic molecule
Emp. Form.:
C8H7F4NO5S2
Mol. Mass.:
337.268
SMILES:
NS(=O)(=O)c1c(F)c(F)c(c(F)c1F)S(=O)(=O)CCO
: