Target
Carbonic anhydrase 9
Ligand
BDBM50429900
Substrate
Meas. Tech.
ChEMBL_1441650 (CHEMBL3377627)
Kd
51±n/a nM
Target
Name:
Carbonic anhydrase 9
Synonyms:
CA-IX CAH9_HUMAN Carbonic anhydrase 9 (CA IX) Carbonic anhydrase 9 precursor Carbonic anhydrase IX (CAIX) Carbonic anhydrases; II & IX MN RCC-associated antigen G250
Type:
Enzyme
Mol. Mass.:
49669.03
Organism:
Homo sapiens (Human)
Description:
Catalytic domain of human cloned isozyme was used in the assay
Residue:
459
  
Inhibitor
Name:
BDBM50429900
Synonyms:
CHEMBL2333417
Type:
Small organic molecule
Emp. Form.:
C8H7F4NO5S2
Mol. Mass.:
337.268
SMILES:
NS(=O)(=O)c1c(F)c(F)c(c(F)c1F)S(=O)(=O)CCO
: