Target
Jak1 protein
Ligand
BDBM103727
Substrate
Meas. Tech.
ChEMBL_1433491 (CHEMBL3382761)
IC50
29±n/a nM
Citation
 Menet, CJFletcher, SRVan Lommen, GGeney, RBlanc, JSmits, KJouannigot, NDeprez, Pvan der Aar, EMClement-Lacroix, PLepescheux, LGalien, RVayssiere, BNelles, LChristophe, TBrys, RUhring, MCiesielski, FVan Rompaey, L Triazolopyridines as selective JAK1 inhibitors: from hit identification to GLPG0634. J Med Chem 57:9323-42 (2014)  
Target
Name:
Jak1 protein
Synonyms:
Jak1 | Jak1 protein
Type:
PROTEIN
Mol. Mass.:
24213.75
Organism:
Rattus norvegicus
Description:
ChEMBL_109515
Residue:
210
  
Inhibitor
Name:
BDBM103727
Synonyms:
US10112907, Example 00033 US10708263, Compound 1 US10919890, Compound 1 US11000528, Cpd # 1 US11279699, Compound Filgotinib | US8563545, 1
Type:
Small organic molecule
Emp. Form.:
C21H23N5O3S
Mol. Mass.:
425.504
SMILES:
O=C(Nc1nc2cccc(-c3ccc(CN4CCS(=O)(=O)CC4)cc3)n2n1)C1CC1
: