Target
Cysteinyl leukotriene receptor 2
Ligand
BDBM50033090
Substrate
Meas. Tech.
ChEMBL_1432711 (CHEMBL3390515)
IC50
1500±n/a nM
Citation
 Itadani, STakahashi, SIma, MSekiguchi, TFujita, MNakayama, YTakeuchi, J Discovery of Highly Potent Dual CysLT1 and CysLT2 Antagonist. ACS Med Chem Lett 5:1230-4 (2014)  
Target
Name:
Cysteinyl leukotriene receptor 2
Synonyms:
CLTR2_HUMAN CYSLT2R Cysteinyl leukotriene receptor Leukotriene Cysteinyl 2
Type:
Enzyme Catalytic Domain
Mol. Mass.:
39657.52
Organism:
Homo sapiens (Human)
Description:
Leukotriene Cysteinyl 2 CYSLTR2 HUMAN::Q9NS75
Residue:
346
  
Inhibitor
Name:
BDBM50033090
Synonyms:
CHEMBL3342960
Type:
Small organic molecule
Emp. Form.:
C28H28N2O8
Mol. Mass.:
520.5305
SMILES:
OC(=O)CCCN1CC(Oc2c(NC(=O)c3ccc(OCCOc4ccccc4)cc3)cccc12)C(O)=O
: