Target
Cytochrome P450 2C19
Ligand
BDBM50032693
Substrate
Meas. Tech.
ChEMBL_1433627 (CHEMBL3385206)
IC50
>20000±n/a nM
Citation
 Hadida, SVan Goor, FZhou, JArumugam, VMcCartney, JHazlewood, ADecker, CNegulescu, PGrootenhuis, PD Discovery of N-(2,4-di-tert-butyl-5-hydroxyphenyl)-4-oxo-1,4-dihydroquinoline-3-carboxamide (VX-770, ivacaftor), a potent and orally bioavailable CFTR potentiator. J Med Chem 57:9776-95 (2014)  
Target
Name:
Cytochrome P450 2C19
Synonyms:
CP2CJ_HUMAN CYPIIC17 Cytochrome P450 2C19 (CYP2C19) Mephenytoin 4-hydroxylase P450-254C
Type:
Enzyme
Mol. Mass.:
55935.47
Organism:
Homo sapiens (Human)
Description:
P33261
Residue:
490
  
Inhibitor
Name:
BDBM50032693
Synonyms:
CHEBI:66901 Kalydeco | VX-770
Type:
Small organic molecule
Emp. Form.:
C24H28N2O3
Mol. Mass.:
392.4907
SMILES:
CC(C)(C)c1cc(c(NC(=O)c2c[nH]c3ccccc3c2=O)cc1O)C(C)(C)C
: