Target
cGMP-specific 3',5'-cyclic phosphodiesterase
Ligand
BDBM50035619
Substrate
Meas. Tech.
ChEMBL_1434379 (CHEMBL3387066)
IC50
5.0±n/a nM
Citation
 Sakamoto, TKoga, YHikota, MMatsuki, KMurakami, MKikkawa, KFujishige, KKotera, JOmori, KMorimoto, HYamada, K Design and synthesis of novel 5-(3,4,5-trimethoxybenzoyl)-4-aminopyrimidine derivatives as potent and selective phosphodiesterase 5 inhibitors: scaffold hopping using a pseudo-ring by intramolecular hydrogen bond formation. Bioorg Med Chem Lett 24:5175-80 (2014)  
Target
Name:
cGMP-specific 3',5'-cyclic phosphodiesterase
Synonyms:
CGB-PDE PDE5A Phosphodiesterase 5A cGMP-specific 3',5'-cyclic phosphodiesterase
Type:
PROTEIN
Mol. Mass.:
98285.03
Organism:
Canis lupus familiaris
Description:
ChEMBL_105565
Residue:
865
  
Inhibitor
Name:
BDBM50035619
Synonyms:
CHEMBL3338446
Type:
Small organic molecule
Emp. Form.:
C29H29ClN4O6
Mol. Mass.:
565.017
SMILES:
COc1ccc(CN(C)c2nc(OCc3ccccn3)ncc2C(=O)c2cc(OC)c(OC)c(OC)c2)cc1Cl
: