Target
Transient receptor potential cation channel subfamily M member 8
Ligand
BDBM50037023
Substrate
Meas. Tech.
ChEMBL_1435149 (CHEMBL3389500)
EC50
5900000±n/a nM
Citation
 Ortar, GSchiano Moriello, AMorera, ENalli, MDi Marzo, VDe Petrocellis, L Effect of acyclic monoterpene alcohols and their derivatives on TRP channels. Bioorg Med Chem Lett 24:5507-11 (2015)  
Target
Name:
Transient receptor potential cation channel subfamily M member 8
Synonyms:
LTRPC6 TRPM8_HUMAN Transient receptor potential M8 protein (TRPM8) Transient receptor potential cation channel subfamily M member 8 (TRPM8)
Type:
Enzyme
Mol. Mass.:
127693.26
Organism:
Homo sapiens (Human)
Description:
Q7Z2W7
Residue:
1104
  
Inhibitor
Name:
BDBM50037023
Synonyms:
CHEBI:17447 | Geraniol
Type:
Small organic molecule
Emp. Form.:
C10H18O
Mol. Mass.:
154.2493
SMILES:
[#6]\[#6](-[#6])=[#6]\[#6]-[#6]\[#6](-[#6])=[#6]\[#6]-[#8]
: