Target
Transient receptor potential cation channel subfamily M member 8
Ligand
BDBM50037023
Substrate
Meas. Tech.
ChEMBL_1435158 (CHEMBL3389509)
IC50
>100000±n/a nM
Citation
 Ortar, GSchiano Moriello, AMorera, ENalli, MDi Marzo, VDe Petrocellis, L Effect of acyclic monoterpene alcohols and their derivatives on TRP channels. Bioorg Med Chem Lett 24:5507-11 (2015)  
Target
Name:
Transient receptor potential cation channel subfamily M member 8
Synonyms:
Cmr1 Transient receptor potential M8 protein (TRPM8) Trpm8
Type:
Enzyme
Mol. Mass.:
127633.53
Organism:
Rattus norvegicus (Rat)
Description:
Q8R455
Residue:
1104
  
Inhibitor
Name:
BDBM50037023
Synonyms:
CHEBI:17447 | Geraniol
Type:
Small organic molecule
Emp. Form.:
C10H18O
Mol. Mass.:
154.2493
SMILES:
[#6]\[#6](-[#6])=[#6]\[#6]-[#6]\[#6](-[#6])=[#6]\[#6]-[#8]
: