Target
C-C chemokine receptor type 3
Ligand
BDBM50041150
Substrate
Meas. Tech.
ChEMBL_1445730 (CHEMBL3374867)
Ki
260±n/a nM
Citation
 Kriegl, JMMartyres, DGrundl, MAAnderskewitz, RDollinger, HRast, GSchmid, BSeither, PTautermann, CS Rodent selectivity of piperidine-4-yl-1H-indoles, a series of CC chemokine receptor-3 (CCR3) antagonists: insights from a receptor model. Bioorg Med Chem Lett 25:229-35 (2014)  
Target
Name:
C-C chemokine receptor type 3
Synonyms:
CCR3_RAT Cmkbr3
Type:
PROTEIN
Mol. Mass.:
41648.91
Organism:
Rattus norvegicus
Description:
ChEMBL_1445730
Residue:
359
  
Inhibitor
Name:
BDBM50041150
Synonyms:
CHEMBL3355932
Type:
Small organic molecule
Emp. Form.:
C24H28F2N2S
Mol. Mass.:
414.554
SMILES:
CCc1[nH]c2cc(F)ccc2c1C1CCN(CCCSc2ccc(F)cc2)CC1
: