Target
Probable C-C chemokine receptor type 3
Ligand
BDBM50041158
Substrate
Meas. Tech.
ChEMBL_1445729 (CHEMBL3374866)
Ki
62±n/a nM
Citation
 Kriegl, JMMartyres, DGrundl, MAAnderskewitz, RDollinger, HRast, GSchmid, BSeither, PTautermann, CS Rodent selectivity of piperidine-4-yl-1H-indoles, a series of CC chemokine receptor-3 (CCR3) antagonists: insights from a receptor model. Bioorg Med Chem Lett 25:229-35 (2014)  
Target
Name:
Probable C-C chemokine receptor type 3
Synonyms:
C-C CKR-3 CC-CKR-3 CCR3_MOUSE CKR3 Cmkbr1l2 MIP-1 alpha RL2 Probable C-C chemokine receptor type 3
Type:
PROTEIN
Mol. Mass.:
41791.57
Organism:
Mus musculus
Description:
ChEMBL_1445729
Residue:
359
  
Inhibitor
Name:
BDBM50041158
Synonyms:
CHEMBL3355934
Type:
Small organic molecule
Emp. Form.:
C25H31FN2S
Mol. Mass.:
410.59
SMILES:
CCc1[nH]c2cc(F)ccc2c1C1CCN(CCCSc2ccc(C)cc2)CC1
: