Target
Cannabinoid receptor 2
Ligand
BDBM50006259
Substrate
Meas. Tech.
ChEMBL_1444456 (CHEMBL3373564)
EC50
0.070000±n/a nM
Citation
 Riether, DZindell, RWu, LBetageri, RJenkins, JEKhor, SBerry, AKHickey, ERErmann, MAlbrecht, CCeci, AGemkow, MJNagaraja, NVRomig, HSauer, AThomson, DS Selective CB2 receptor agonists. Part 2: Structure-activity relationship studies and optimization of proline-based compounds. Bioorg Med Chem Lett 25:581-6 (2015)  
Target
Name:
Cannabinoid receptor 2
Synonyms:
CANNABINOID CB2 CB2 CB2B CNR2_HUMAN Cannabinoid CB2 receptor Cannabinoid receptor 2 (CB2R) | hCB2
Type:
G Protein-Coupled Receptor (GPCR)
Mol. Mass.:
39690.94
Organism:
Homo sapiens (Human)
Description:
P34972
Residue:
360
  
Inhibitor
Name:
BDBM50006259
Synonyms:
CHEMBL3234706
Type:
Small organic molecule
Emp. Form.:
C18H21F3N4O2
Mol. Mass.:
382.3801
SMILES:
CC(C)(C)c1cc(NC(=O)[C@@H]2CCCN2c2ccc(cn2)C(F)(F)F)no1
: