Target
Streptavidin
Ligand
BDBM12
Substrate
Meas. Tech.
ChEMBL_1458982 (CHEMBL3369575)
Kd
0.000±n/a nM
Citation
 Gibbs, AC Elements and modulation of functional dynamics. J Med Chem 57:7819-37 (2014)  
Target
Name:
Streptavidin
Synonyms:
SAV_STRAV
Type:
Protein
Mol. Mass.:
18835.54
Organism:
Streptomyces avidinii
Description:
P22629
Residue:
183
  
Inhibitor
Name:
BDBM12
Synonyms:
5-[(3aS,4S,6aR)-2-oxo-hexahydro-1H-thieno[3,4-d]imidazolidin-4-yl]pentanoic acid cid_171548 | cid_253
Type:
Enzyme co-factor
Emp. Form.:
C10H16N2O3S
Mol. Mass.:
244.311
SMILES:
[H][C@]12CS[C@@H](CCCCC(O)=O)[C@@]1([H])NC(=O)N2
: