Target
Indoleamine 2,3-dioxygenase 1
Ligand
BDBM50051844
Substrate
Meas. Tech.
ChEMBL_1452147 (CHEMBL3365093)
IC50
28000±n/a nM
Citation
 Röhrig, UFMajjigapu, SRChambon, MBron, SPilotte, LColau, DVan den Eynde, BJTurcatti, GVogel, PZoete, VMichielin, O Detailed analysis and follow-up studies of a high-throughput screening for indoleamine 2,3-dioxygenase 1 (IDO1) inhibitors. Eur J Med Chem 84:284-301 (2014)  
Target
Name:
Indoleamine 2,3-dioxygenase 1
Synonyms:
I23O1_HUMAN IDO-1 INDO Indoleamine 2,3-dioxygenase | Indoleamine-pyrrole 2,3-dioxygenase
Type:
Enzyme
Mol. Mass.:
45330.80
Organism:
Homo sapiens (Human)
Description:
P14902
Residue:
403
  
Inhibitor
Name:
BDBM50051844
Synonyms:
CHEBI:7825 Oxistat | Oxizole
Type:
Small organic molecule
Emp. Form.:
C18H13Cl4N3O
Mol. Mass.:
429.127
SMILES:
Clc1ccc(CO\N=C(/Cn2ccnc2)c2ccc(Cl)cc2Cl)c(Cl)c1
: