Target
D(3) dopamine receptor
Ligand
BDBM50053385
Substrate
Meas. Tech.
ChEMBL_1460138 (CHEMBL3369123)
Ki
220±n/a nM
Citation
 Salama, ILöber, SHübner, HGmeiner, P Synthesis and binding profile of haloperidol-based bivalent ligands targeting dopamine D(2)-like receptors. Bioorg Med Chem Lett 24:3753-6 (2014)  
Target
Name:
D(3) dopamine receptor
Synonyms:
DOPAMINE D3 DRD3_HUMAN Dopamine D3 receptor (D3) Dopamine receptor Dopamine receptor D3
Type:
Mol. Mass.:
44243.43
Organism:
Homo sapiens (Human)
Description:
Residue:
400
  
Inhibitor
Name:
BDBM50053385
Synonyms:
CHEMBL3318840
Type:
Small organic molecule
Emp. Form.:
C58H72Cl2F2N2O6
Mol. Mass.:
1002.105
SMILES:
Fc1ccc(cc1)C(=O)CCCN1CCC(CC1)(OC(=O)CCCCCCCCCCCCCCC(=O)OC1(CCN(CCCC(=O)c2ccc(F)cc2)CC1)c1ccc(Cl)cc1)c1ccc(Cl)cc1
: