Target
D(1A) dopamine receptor
Ligand
BDBM50053409
Substrate
Meas. Tech.
ChEMBL_1460140 (CHEMBL3369125)
Ki
360±n/a nM
Citation
 Salama, ILöber, SHübner, HGmeiner, P Synthesis and binding profile of haloperidol-based bivalent ligands targeting dopamine D(2)-like receptors. Bioorg Med Chem Lett 24:3753-6 (2014)  
Target
Name:
D(1A) dopamine receptor
Synonyms:
DRD1 Dopamine D1 receptor
Type:
PROTEIN
Mol. Mass.:
49269.92
Organism:
Sus scrofa
Description:
ChEMBL_1460140
Residue:
446
  
Inhibitor
Name:
BDBM50053409
Synonyms:
CHEMBL3318846
Type:
Small organic molecule
Emp. Form.:
C52H60Cl2F2N4O6
Mol. Mass.:
945.959
SMILES:
Fc1ccc(cc1)C(=O)CCCN1CCC(CC1)(OC(=O)CCN1CCN(CCC(=O)OC2(CCN(CCCC(=O)c3ccc(F)cc3)CC2)c2ccc(Cl)cc2)CC1)c1ccc(Cl)cc1
: