Target
Multidrug resistance-associated protein 1
Ligand
BDBM81939
Substrate
Meas. Tech.
ChEMBL_1449769 (CHEMBL3378756)
IC50
3500±n/a nM
Citation
 Tardia, PStefanachi, ANiso, MStolfa, DAMangiatordi, GFAlberga, DNicolotti, OLattanzi, GCarotti, ALeonetti, FPerrone, RBerardi, FAzzariti, AColabufo, NACellamare, S Trimethoxybenzanilide-based P-glycoprotein modulators: an interesting case of lipophilicity tuning by intramolecular hydrogen bonding. J Med Chem 57:6403-18 (2014)  
Target
Name:
Multidrug resistance-associated protein 1
Synonyms:
7.6.2.2 ABCC1 ATP-binding cassette, sub-family C, member 1 isoform 1 LTC4 transporter MRP MRP1_HUMAN
Type:
Mol. Mass.:
171597.72
Organism:
Homo sapiens (Human)
Description:
P33527
Residue:
1531
  
Inhibitor
Name:
BDBM81939
Synonyms:
CAS_52-53-9 VERAPAMIL
Type:
Small organic molecule
Emp. Form.:
C27H38N2O4
Mol. Mass.:
454.6016
SMILES:
COc1ccc(CCN(C)CCCC(C#N)(C(C)C)c2ccc(OC)c(OC)c2)cc1OC
: