Target
D(3) dopamine receptor
Ligand
BDBM50057776
Substrate
Meas. Tech.
ChEMBL_1449821 (CHEMBL3379350)
Ki
36±n/a nM
Citation
 Ananthan, SSaini, SKZhou, GHobrath, JVPadmalayam, IZhai, LBostwick, JRAntonio, TReith, MEMcDowell, SCho, EMcAleer, LTaylor, MLuedtke, RR Design, synthesis, and structure-activity relationship studies of a series of [4-(4-carboxamidobutyl)]-1-arylpiperazines: insights into structural features contributing to dopamine D3 versus D2 receptor subtype selectivity. J Med Chem 57:7042-60 (2014)  
Target
Name:
D(3) dopamine receptor
Synonyms:
DOPAMINE D3 DRD3_HUMAN Dopamine D3 receptor (D3) Dopamine receptor Dopamine receptor D3
Type:
Mol. Mass.:
44243.43
Organism:
Homo sapiens (Human)
Description:
Residue:
400
  
Inhibitor
Name:
BDBM50057776
Synonyms:
CHEMBL3323116 US9969743, 109
Type:
Small organic molecule
Emp. Form.:
C30H43F3N6O
Mol. Mass.:
560.6972
SMILES:
CC(C)(C)c1nc(cc(n1)C(F)(F)F)N1CCN(CCCCNC(=O)C2CCN(Cc3ccccc3)CC2)CC1
: