Target
5-hydroxytryptamine receptor 7
Ligand
BDBM50058349
Substrate
Meas. Tech.
ChEMBL_1456828 (CHEMBL3367561)
Ki
26±n/a nM
Citation
 Salerno, LPittalą, VModica, MNSiracusa, MAIntagliata, SCagnotto, ASalmona, MKurczab, RBojarski, AJRomeo, G Structure-activity relationships and molecular modeling studies of novel arylpiperazinylalkyl 2-benzoxazolones and 2-benzothiazolones as 5-HT(7) and 5-HT(1A) receptor ligands. Eur J Med Chem 85:716-26 (2014)  
Target
Name:
5-hydroxytryptamine receptor 7
Synonyms:
5-HT-7 5-HT7 5-HT7S 5HT7 HTR7 | Serotonin receptor 7
Type:
G Protein-Coupled Receptor (GPCR)
Mol. Mass.:
53573.08
Organism:
Homo sapiens (Human)
Description:
P34969
Residue:
479
  
Inhibitor
Name:
BDBM50058349
Synonyms:
CHEMBL3331254 US9724435, Compound SN-251
Type:
Small organic molecule
Emp. Form.:
C21H25N3O2
Mol. Mass.:
351.4421
SMILES:
O=c1oc2ccccc2n1CCCCN1CCN(CC1)c1ccccc1
: