Target
5-hydroxytryptamine receptor 7
Ligand
BDBM50267832
Substrate
Meas. Tech.
ChEMBL_1456828 (CHEMBL3367561)
Ki
7.0±n/a nM
Citation
 Salerno, LPittalą, VModica, MNSiracusa, MAIntagliata, SCagnotto, ASalmona, MKurczab, RBojarski, AJRomeo, G Structure-activity relationships and molecular modeling studies of novel arylpiperazinylalkyl 2-benzoxazolones and 2-benzothiazolones as 5-HT(7) and 5-HT(1A) receptor ligands. Eur J Med Chem 85:716-26 (2014)  
Target
Name:
5-hydroxytryptamine receptor 7
Synonyms:
5-HT-7 5-HT7 5-HT7S 5HT7 HTR7 | Serotonin receptor 7
Type:
G Protein-Coupled Receptor (GPCR)
Mol. Mass.:
53573.08
Organism:
Homo sapiens (Human)
Description:
P34969
Residue:
479
  
Inhibitor
Name:
BDBM50267832
Synonyms:
1-[4-(3,4-Dihydroisoquinolin-2(1H)-yl)butyl]-1,3-dihydro-2Hindol-2-one | CHEMBL445334
Type:
Small organic molecule
Emp. Form.:
C21H24N2O
Mol. Mass.:
320.4281
SMILES:
O=C1Cc2ccccc2N1CCCCN1CCc2ccccc2C1
: