Target
5-hydroxytryptamine receptor 1A
Ligand
BDBM50058305
Substrate
Meas. Tech.
ChEMBL_1456829 (CHEMBL3367562)
Ki
0.210000±n/a nM
Citation
 Salerno, LPittalą, VModica, MNSiracusa, MAIntagliata, SCagnotto, ASalmona, MKurczab, RBojarski, AJRomeo, G Structure-activity relationships and molecular modeling studies of novel arylpiperazinylalkyl 2-benzoxazolones and 2-benzothiazolones as 5-HT(7) and 5-HT(1A) receptor ligands. Eur J Med Chem 85:716-26 (2014)  
Target
Name:
5-hydroxytryptamine receptor 1A
Synonyms:
5-HT-1A 5-hydroxytryptamine receptor 1A (5-HT-1A) ADRB2RL1 Dopamine D2 receptor and serotonin 1a receptor HTR1A | Serotonin receptor 1A
Type:
Mol. Mass.:
46122.49
Organism:
Homo sapiens (Human)
Description:
Residue:
422
  
Inhibitor
Name:
BDBM50058305
Synonyms:
CHEMBL3331391
Type:
Small organic molecule
Emp. Form.:
C25H33N3O2S
Mol. Mass.:
439.613
SMILES:
COc1ccccc1N1CCN(CCCCCCCn2c3ccccc3sc2=O)CC1
: