Target
Carbonic anhydrase 1
Ligand
BDBM50028010
Substrate
Meas. Tech.
ChEMBL_1456832 (CHEMBL3367565)
Ki
56±n/a nM
Citation
 Prete, SDVullo, DOsman, SMScozzafava, AAlOthman, ZCapasso, CSupuran, CT Sulfonamide inhibition study of the carbonic anhydrases from the bacterial pathogen Porphyromonas gingivalis: theß-class (PgiCAb) versus the¿-class (PgiCA) enzymes. Bioorg Med Chem 22:4537-43 (2014)  
Target
Name:
Carbonic anhydrase 1
Synonyms:
CA-I CAB Carbonate dehydratase I Carbonic anhydrase 1 (CA I) Carbonic anhydrase 1 (Recombinant CA I) Carbonic anhydrase B Carbonic anhydrase I (CA I) Carbonic anhydrase I (CAI) Carbonic anhydrase isoenzyme I (hCA I) | hCA
Type:
Enzyme
Mol. Mass.:
28873.37
Organism:
Homo sapiens (Human)
Description:
P00915
Residue:
261
  
Inhibitor
Name:
BDBM50028010
Synonyms:
AD-810 CI-912 Zonegran | Zonisamide
Type:
Small organic molecule
Emp. Form.:
C8H8N2O3S
Mol. Mass.:
212.226
SMILES:
OS(=N)(=O)Cc1noc2ccccc12
: