Target
Cannabinoid receptor 1
Ligand
BDBM50058438
Substrate
Meas. Tech.
ChEMBL_1459579 (CHEMBL3369614)
Ki
160±n/a nM
Citation
 Pinna, GCurzu, MMDore, ALazzari, PRuiu, SPau, AMurineddu, GPinna, GA Tricyclic pyrazoles part 7. Discovery of potent and selective dihydrothienocyclopentapyrazole derived CB2 ligands. Eur J Med Chem 85:747-57 (2014)  
Target
Name:
Cannabinoid receptor 1
Synonyms:
Brain-type cannabinoid receptor CB-R CNR1_MOUSE Cannabinoid receptor | Cnr1
Type:
Enzyme
Mol. Mass.:
52842.52
Organism:
Mus musculus (Mouse)
Description:
P47746
Residue:
473
  
Inhibitor
Name:
BDBM50058438
Synonyms:
CHEMBL3329244
Type:
Small organic molecule
Emp. Form.:
C28H35N3OS
Mol. Mass.:
461.662
SMILES:
CC(C)[C@H]1CC[C@H](C)CC1NC(=O)c1nn(Cc2ccc(C)cc2)c-2c1Cc1scc(C)c-21
: