Target
Cannabinoid receptor 2
Ligand
BDBM50058501
Substrate
Meas. Tech.
ChEMBL_1459580 (CHEMBL3369615)
Ki
5.3±n/a nM
Citation
 Pinna, GCurzu, MMDore, ALazzari, PRuiu, SPau, AMurineddu, GPinna, GA Tricyclic pyrazoles part 7. Discovery of potent and selective dihydrothienocyclopentapyrazole derived CB2 ligands. Eur J Med Chem 85:747-57 (2014)  
Target
Name:
Cannabinoid receptor 2
Synonyms:
CANNABINOID CB2 CB2 Cannabinoid CB2 receptor Cannabinoid receptor 2 mCB2
Type:
Enzyme Catalytic Domain
Mol. Mass.:
38220.43
Organism:
MOUSE
Description:
P47936
Residue:
347
  
Inhibitor
Name:
BDBM50058501
Synonyms:
CHEMBL3331453
Type:
Small organic molecule
Emp. Form.:
C26H27Cl2N3OS
Mol. Mass.:
500.483
SMILES:
Cc1csc2Cc3c(nn(c3-c12)-c1ccc(Cl)cc1Cl)C(=O)NC1[C@@]2(C)CCC(C2)C1(C)C
: