Target
Cannabinoid receptor 2
Ligand
BDBM50058496
Substrate
Meas. Tech.
ChEMBL_1459580 (CHEMBL3369615)
Ki
191±n/a nM
Citation
 Pinna, GCurzu, MMDore, ALazzari, PRuiu, SPau, AMurineddu, GPinna, GA Tricyclic pyrazoles part 7. Discovery of potent and selective dihydrothienocyclopentapyrazole derived CB2 ligands. Eur J Med Chem 85:747-57 (2014)  
Target
Name:
Cannabinoid receptor 2
Synonyms:
CANNABINOID CB2 CB2 Cannabinoid CB2 receptor Cannabinoid receptor 2 mCB2
Type:
Enzyme Catalytic Domain
Mol. Mass.:
38220.43
Organism:
MOUSE
Description:
P47936
Residue:
347
  
Inhibitor
Name:
BDBM50058496
Synonyms:
CHEMBL3331448
Type:
Small organic molecule
Emp. Form.:
C24H27N3OS
Mol. Mass.:
405.556
SMILES:
Cc1csc2Cc3c(nn(Cc4ccc(C)cc4)c3-c12)C(=O)NC1CCCCC1
: