Target
Serine/threonine-protein kinase pim-1
Ligand
BDBM50061611
Substrate
Meas. Tech.
ChEMBL_1461782 (CHEMBL3395658)
IC50
12±n/a nM
Citation
 Wu, BWang, HLCee, VJLanman, BANixey, TPettus, LReed, ABWurz, RPGuerrero, NSastri, CWinston, JLipford, JRLee, MRMohr, CAndrews, KLTasker, AS Discovery of 5-(1H-indol-5-yl)-1,3,4-thiadiazol-2-amines as potent PIM inhibitors. Bioorg Med Chem Lett 25:775-80 (2015)  
Target
Name:
Serine/threonine-protein kinase pim-1
Synonyms:
PIM-1 Kinase PIM1_HUMAN Serine/threonine-protein kinase (PIM1) Serine/threonine-protein kinase PIM1 | Serine/threonine-protein kinase pim-1 (PIM1)
Type:
Protein
Mol. Mass.:
35681.82
Organism:
Homo sapiens (Human)
Description:
P11309
Residue:
313
  
Inhibitor
Name:
BDBM50061611
Synonyms:
CHEMBL3394069 | US9321756, 16
Type:
Small organic molecule
Emp. Form.:
C20H20N6S
Mol. Mass.:
376.478
SMILES:
Nc1nnc(s1)-c1ccc2[nH]cc(-c3cccc(NC4CCCC4)n3)c2c1
: