Target
Peroxisome proliferator-activated receptor alpha
Ligand
BDBM50062511
Substrate
Meas. Tech.
ChEMBL_1462845 (CHEMBL3399719)
EC50
220±n/a nM
Citation
 Piemontese, LFracchiolla, GCarrieri, AParente, MLaghezza, ACarbonara, GSblano, STauro, MGilardi, FTortorella, PLavecchia, ACrestani, MDesvergne, BLoiodice, F Design, synthesis and biological evaluation of a class of bioisosteric oximes of the novel dual peroxisome proliferator-activated receptora/¿ ligand LT175. Eur J Med Chem 90:583-94 (2015)  
Target
Name:
Peroxisome proliferator-activated receptor alpha
Synonyms:
NR1C1 PPAR PPAR-alpha PPARA_HUMAN Peroxisome proliferator-activated receptor | Peroxisome proliferator-activated receptor alpha (PPAR alpha)
Type:
Enzyme
Mol. Mass.:
52222.08
Organism:
Homo sapiens (Human)
Description:
Q07869
Residue:
468
  
Inhibitor
Name:
BDBM50062511
Synonyms:
CHEMBL3397563
Type:
Small organic molecule
Emp. Form.:
C25H25NO4
Mol. Mass.:
403.4703
SMILES:
CCCO\N=C(\c1ccccc1)c1ccc(OC(Cc2ccccc2)C(O)=O)cc1
: