Target
Peroxisome proliferator-activated receptor gamma
Ligand
BDBM50062519
Substrate
Meas. Tech.
ChEMBL_1462847 (CHEMBL3399721)
EC50
4500±n/a nM
Citation
 Piemontese, LFracchiolla, GCarrieri, AParente, MLaghezza, ACarbonara, GSblano, STauro, MGilardi, FTortorella, PLavecchia, ACrestani, MDesvergne, BLoiodice, F Design, synthesis and biological evaluation of a class of bioisosteric oximes of the novel dual peroxisome proliferator-activated receptora/¿ ligand LT175. Eur J Med Chem 90:583-94 (2015)  
Target
Name:
Peroxisome proliferator-activated receptor gamma
Synonyms:
NR1C3 PPAR-gamma PPARG_HUMAN Peroxisome proliferator-activated receptor gamma (PPAR gamma) Peroxisome proliferator-activated receptor gamma (PPARγ) peroxisome proliferator-activated receptor gamma isoform 2
Type:
Nuclear Receptor
Mol. Mass.:
57613.46
Organism:
Homo sapiens (Human)
Description:
P37231
Residue:
505
  
Inhibitor
Name:
BDBM50062519
Synonyms:
CHEMBL3397556
Type:
Small organic molecule
Emp. Form.:
C20H22NNaO4
Mol. Mass.:
363.3827
SMILES:
[Na+].CC(C)CO\N=C\c1ccc(OC(Cc2ccccc2)C([O-])=O)cc1
: