Target
Peroxisome proliferator-activated receptor alpha
Ligand
BDBM50062521
Substrate
Meas. Tech.
ChEMBL_1462845 (CHEMBL3399719)
EC50
4200±n/a nM
Citation
 Piemontese, LFracchiolla, GCarrieri, AParente, MLaghezza, ACarbonara, GSblano, STauro, MGilardi, FTortorella, PLavecchia, ACrestani, MDesvergne, BLoiodice, F Design, synthesis and biological evaluation of a class of bioisosteric oximes of the novel dual peroxisome proliferator-activated receptora/¿ ligand LT175. Eur J Med Chem 90:583-94 (2015)  
Target
Name:
Peroxisome proliferator-activated receptor alpha
Synonyms:
NR1C1 PPAR PPAR-alpha PPARA_HUMAN Peroxisome proliferator-activated receptor | Peroxisome proliferator-activated receptor alpha (PPAR alpha)
Type:
Enzyme
Mol. Mass.:
52222.08
Organism:
Homo sapiens (Human)
Description:
Q07869
Residue:
468
  
Inhibitor
Name:
BDBM50062521
Synonyms:
CHEMBL3397555
Type:
Small organic molecule
Emp. Form.:
C19H20NNaO4
Mol. Mass.:
349.3562
SMILES:
[Na+].CC(C)O\N=C\c1ccc(OC(Cc2ccccc2)C([O-])=O)cc1
: