Target
Peroxisome proliferator-activated receptor alpha
Ligand
BDBM24566
Substrate
Meas. Tech.
ChEMBL_1462845 (CHEMBL3399719)
EC50
1620±n/a nM
Citation
 Piemontese, LFracchiolla, GCarrieri, AParente, MLaghezza, ACarbonara, GSblano, STauro, MGilardi, FTortorella, PLavecchia, ACrestani, MDesvergne, BLoiodice, F Design, synthesis and biological evaluation of a class of bioisosteric oximes of the novel dual peroxisome proliferator-activated receptora/¿ ligand LT175. Eur J Med Chem 90:583-94 (2015)  
Target
Name:
Peroxisome proliferator-activated receptor alpha
Synonyms:
NR1C1 PPAR PPAR-alpha PPARA_HUMAN Peroxisome proliferator-activated receptor | Peroxisome proliferator-activated receptor alpha (PPAR alpha)
Type:
Enzyme
Mol. Mass.:
52222.08
Organism:
Homo sapiens (Human)
Description:
Q07869
Residue:
468
  
Inhibitor
Name:
BDBM24566
Synonyms:
2-({4-chloro-6-[(2,3-dimethylphenyl)amino]pyrimidin-2-yl}sulfanyl)acetic acid JMC515449 Compound 1 Wyeth 14,643
Type:
Small organic molecule
Emp. Form.:
C14H14ClN3O2S
Mol. Mass.:
323.798
SMILES:
Cc1cccc(Nc2cc(Cl)nc(SCC(O)=O)n2)c1C
: