Target
Prostaglandin E synthase
Ligand
BDBM50062730
Substrate
Meas. Tech.
ChEMBL_1462977 (CHEMBL3398721)
IC50
1600±n/a nM
Citation
 Flesch, DNess, JLamers, CDehm, FPopella, SSteri, ROgorek, IHieke, MDannhardt, GWerz, OWeggen, SSchubert-Zsilavecz, M SAR-studies of¿-secretase modulators with PPAR¿-agonistic and 5-lipoxygenase-inhibitory activity for Alzheimer's disease. Bioorg Med Chem Lett 25:841-6 (2015)  
Target
Name:
Prostaglandin E synthase
Synonyms:
MGST1L1 PGES PTGES Prostaglandin E synthase (PGES-1) Prostaglandin E synthase-1 (PGES-1) Prostaglandin E2 synthase-1 ( mPGES-1)
Type:
Protein
Mol. Mass.:
17112.22
Organism:
Homo sapiens (Human)
Description:
Residue:
152
  
Inhibitor
Name:
BDBM50062730
Synonyms:
CHEMBL3397716
Type:
Small organic molecule
Emp. Form.:
C28H25Cl2F3O4
Mol. Mass.:
553.397
SMILES:
CCCC\C(=C/c1cc(OCc2ccc(Cl)c(Cl)c2)ccc1OCc1ccc(cc1)C(F)(F)F)C(O)=O
: