Target
Amine oxidase [flavin-containing] B
Ligand
BDBM50172756
Substrate
Meas. Tech.
ChEMBL_1464177 (CHEMBL3407043)
Ki
20±n/a nM
Citation
 Rojas, RJEdmondson, DEAlmos, TScott, RMassari, ME Reversible and irreversible small molecule inhibitors of monoamine oxidase B (MAO-B) investigated by biophysical techniques. Bioorg Med Chem 23:770-8 (2015)  
Target
Name:
Amine oxidase [flavin-containing] B
Synonyms:
AOFB_HUMAN MAOB Monoamine oxidase type B (MAO B) Monoamine oxidase type B (MAOB)
Type:
Protein
Mol. Mass.:
58768.76
Organism:
Homo sapiens (Human)
Description:
P27338
Residue:
520
  
Inhibitor
Name:
BDBM50172756
Synonyms:
Benzyl-methyl-prop-2-ynyl-amine Eutonyl N-benzyl-N-methylprop-2-yn-1-amine US9603833, Pargyline
Type:
Small organic molecule
Emp. Form.:
C11H13N
Mol. Mass.:
159.2276
SMILES:
CN(CC#C)Cc1ccccc1
: