Target
Cysteinyl leukotriene receptor 1
Ligand
BDBM50066897
Substrate
Meas. Tech.
ChEMBL_1466140 (CHEMBL3404758)
IC50
58±n/a nM
Citation
 Itadani, STakahashi, SIma, MSekiguchi, TAratani, YEgashira, HMatsumura, NInoue, AYonetomi, YFujita, MNakayama, YTakeuchi, J Discovery of a potent, orally available dual CysLT1 and CysLT2 antagonist with dicarboxylic acid. Bioorg Med Chem 23:2079-97 (2015)  
Target
Name:
Cysteinyl leukotriene receptor 1
Synonyms:
CLTR1_HUMAN CYSLTR1 Cysteinyl leukotriene receptor HG55 LTD4 receptor | Leukotriene Cysteinyl 1
Type:
Enzyme Catalytic Domain
Mol. Mass.:
38565.16
Organism:
Homo sapiens (Human)
Description:
Leukotriene Cysteinyl 1 CYSLTR1 HUMAN::Q9Y271
Residue:
337
  
Inhibitor
Name:
BDBM50066897
Synonyms:
CHEMBL3401686
Type:
Small organic molecule
Emp. Form.:
C30H33NO7
Mol. Mass.:
519.5855
SMILES:
OC(=O)CCCN1CC(Oc2c(OCc3ccc(OCCCCc4ccccc4)cc3)cccc12)C(O)=O
: