Target
Cysteinyl leukotriene receptor 2
Ligand
BDBM50066950
Substrate
Meas. Tech.
ChEMBL_1466141 (CHEMBL3404759)
IC50
370±n/a nM
Citation
 Itadani, STakahashi, SIma, MSekiguchi, TAratani, YEgashira, HMatsumura, NInoue, AYonetomi, YFujita, MNakayama, YTakeuchi, J Discovery of a potent, orally available dual CysLT1 and CysLT2 antagonist with dicarboxylic acid. Bioorg Med Chem 23:2079-97 (2015)  
Target
Name:
Cysteinyl leukotriene receptor 2
Synonyms:
CLTR2_HUMAN CYSLT2R Cysteinyl leukotriene receptor Leukotriene Cysteinyl 2
Type:
Enzyme Catalytic Domain
Mol. Mass.:
39657.52
Organism:
Homo sapiens (Human)
Description:
Leukotriene Cysteinyl 2 CYSLTR2 HUMAN::Q9NS75
Residue:
346
  
Inhibitor
Name:
BDBM50066950
Synonyms:
CHEMBL3403188
Type:
Small organic molecule
Emp. Form.:
C32H31NO7
Mol. Mass.:
541.591
SMILES:
OC(=O)CCCn1cc(C(O)=O)c(=O)c2c(\C=C\c3ccc(OCCCCOc4ccccc4)cc3)cccc12
: