Target
Carbonic anhydrase 2
Ligand
BDBM13063
Substrate
Meas. Tech.
ChEMBL_1466706 (CHEMBL3404499)
Ki
43±n/a nM
Citation
 Syrjänen, LKuuslahti, MTolvanen, MVullo, DParkkila, SSupuran, CT Theß-carbonic anhydrase from the malaria mosquito Anopheles gambiae is highly inhibited by sulfonamides. Bioorg Med Chem 23:2303-9 (2015)  
Target
Name:
Carbonic anhydrase 2
Synonyms:
CA-II CAC Carbonate dehydratase II Carbonic anhydrase 2 (CA-II) Carbonic anhydrase C Carbonic anhydrase II (CA-II) Carbonic anhydrase II (hCA II) | Carbonic anhydrase isoenzyme II (hCA II)
Type:
Enzyme
Mol. Mass.:
29250.71
Organism:
Homo sapiens (Human)
Description:
P00918
Residue:
260
  
Inhibitor
Name:
BDBM13063
Synonyms:
4-(5-methyl-3-phenyl-1,2-oxazol-4-yl)benzene-1-sulfonamide CHEMBL865 Valdecoxib | cid_119607
Type:
Small organic molecule
Emp. Form.:
C16H14N2O3S
Mol. Mass.:
314.359
SMILES:
Cc1onc(c1-c1ccc(cc1)S(N)(=O)=O)-c1ccccc1
: