Target
Carbonic anhydrase 2
Ligand
BDBM10884
Substrate
Meas. Tech.
ChEMBL_1466706 (CHEMBL3404499)
Ki
9.0±n/a nM
Citation
 Syrjänen, LKuuslahti, MTolvanen, MVullo, DParkkila, SSupuran, CT Theß-carbonic anhydrase from the malaria mosquito Anopheles gambiae is highly inhibited by sulfonamides. Bioorg Med Chem 23:2303-9 (2015)  
Target
Name:
Carbonic anhydrase 2
Synonyms:
CA-II CAC Carbonate dehydratase II Carbonic anhydrase 2 (CA-II) Carbonic anhydrase C Carbonic anhydrase II (CA-II) Carbonic anhydrase II (hCA II) | Carbonic anhydrase isoenzyme II (hCA II)
Type:
Enzyme
Mol. Mass.:
29250.71
Organism:
Homo sapiens (Human)
Description:
P00918
Residue:
260
  
Inhibitor
Name:
BDBM10884
Synonyms:
(2S,4S)-4-(ethylamino)-2-methyl-1,1-dioxo-2H,3H,4H-1,7-thieno[2,3-b]thiopyran-6-sulfonamide Dorzolamide (DZA)
Type:
Small organic molecule
Emp. Form.:
C10H16N2O4S3
Mol. Mass.:
324.44
SMILES:
CCN[C@H]1C[C@H](C)S(=O)(=O)c2sc(cc12)S(N)(=O)=O
: