Target
Carbonic anhydrase 2
Ligand
BDBM50427222
Substrate
Meas. Tech.
ChEMBL_1466706 (CHEMBL3404499)
Ki
11±n/a nM
Citation
 Syrjänen, LKuuslahti, MTolvanen, MVullo, DParkkila, SSupuran, CT Theß-carbonic anhydrase from the malaria mosquito Anopheles gambiae is highly inhibited by sulfonamides. Bioorg Med Chem 23:2303-9 (2015)  
Target
Name:
Carbonic anhydrase 2
Synonyms:
CA-II CAC Carbonate dehydratase II Carbonic anhydrase 2 (CA-II) Carbonic anhydrase C Carbonic anhydrase II (CA-II) Carbonic anhydrase II (hCA II) | Carbonic anhydrase isoenzyme II (hCA II)
Type:
Enzyme
Mol. Mass.:
29250.71
Organism:
Homo sapiens (Human)
Description:
P00918
Residue:
260
  
Inhibitor
Name:
BDBM50427222
Synonyms:
CHEMBL2324864
Type:
Small organic molecule
Emp. Form.:
C15H17N3O7S2
Mol. Mass.:
415.441
SMILES:
NS(=O)(=O)c1ccc(CCNS(=O)(=O)c2ccc(cc2CO)[N+]([O-])=O)cc1
: