Target
Carbonic anhydrase 2
Ligand
BDBM4703
Substrate
Meas. Tech.
ChEMBL_1466706 (CHEMBL3404499)
Ki
46±n/a nM
Citation
 Syrjänen, LKuuslahti, MTolvanen, MVullo, DParkkila, SSupuran, CT Theß-carbonic anhydrase from the malaria mosquito Anopheles gambiae is highly inhibited by sulfonamides. Bioorg Med Chem 23:2303-9 (2015)  
Target
Name:
Carbonic anhydrase 2
Synonyms:
CA-II CAC Carbonate dehydratase II Carbonic anhydrase 2 (CA-II) Carbonic anhydrase C Carbonic anhydrase II (CA-II) Carbonic anhydrase II (hCA II) | Carbonic anhydrase isoenzyme II (hCA II)
Type:
Enzyme
Mol. Mass.:
29250.71
Organism:
Homo sapiens (Human)
Description:
P00918
Residue:
260
  
Inhibitor
Name:
BDBM4703
Synonyms:
4-carboxybenzenesulfonamide 1 Benzoic Acid deriv. 31 JMC522226 Compound 22 JMC52646 Compound 23 | aromatic/heteroaromatic sulfonamide 23
Type:
Small organic molecule
Emp. Form.:
C7H7NO4S
Mol. Mass.:
201.2
SMILES:
NS(=O)(=O)c1ccc(cc1)C(O)=O
: