Target
Tyrosine-protein kinase JAK2
Ligand
BDBM50069325
Substrate
Meas. Tech.
ChEMBL_1466708 (CHEMBL3404501)
IC50
68±n/a nM
Citation
 Brasca, MGGnocchi, PNesi, MAmboldi, NAvanzi, NBertrand, JBindi, SCanevari, GCasero, DCiomei, MColombo, NCribioli, SFachin, GFelder, ERGalvani, AIsacchi, AMotto, IPanzeri, ADonati, D Novel pyrrole carboxamide inhibitors of JAK2 as potential treatment of myeloproliferative disorders. Bioorg Med Chem 23:2387-407 (2015)  
Target
Name:
Tyrosine-protein kinase JAK2
Synonyms:
JAK-2 JAK2_HUMAN Janus kinase 2 (JAK2) | Janus kinase 2 (a protein tyrosine kinase)
Type:
Protein
Mol. Mass.:
130684.68
Organism:
Homo sapiens (Human)
Description:
O60674
Residue:
1132
  
Inhibitor
Name:
BDBM50069325
Synonyms:
CHEMBL3403542 | US9688661, 1-(5-chloro-2-methylphenyl)-4-(pyrrolo[2,1-f][1,2,4]triazin-4-yl)-1H-pyrrole-2-carboxamide (compd 233)
Type:
Small organic molecule
Emp. Form.:
C18H14ClN5O
Mol. Mass.:
351.79
SMILES:
Cc1ccc(Cl)cc1-n1cc(cc1C(N)=O)-c1ncnn2cccc12
: