Target
Cannabinoid receptor 2
Ligand
BDBM50073005
Substrate
Meas. Tech.
ChEMBL_1468240 (CHEMBL3411783)
Ki
0.086896±n/a nM
Citation
 Han, SZhang, FFQian, HYChen, LLPu, JBXie, XChen, JZ Design, syntheses, structure-activity relationships and docking studies of coumarin derivatives as novel selective ligands for the CB2 receptor. Eur J Med Chem 93:16-32 (2015)  
Target
Name:
Cannabinoid receptor 2
Synonyms:
CANNABINOID CB2 CB2 CB2B CNR2_HUMAN Cannabinoid CB2 receptor Cannabinoid receptor 2 (CB2R) | hCB2
Type:
G Protein-Coupled Receptor (GPCR)
Mol. Mass.:
39690.94
Organism:
Homo sapiens (Human)
Description:
P34972
Residue:
360
  
Inhibitor
Name:
BDBM50073005
Synonyms:
CHEMBL3410729
Type:
Small organic molecule
Emp. Form.:
C24H25NO7
Mol. Mass.:
439.4578
SMILES:
CCCCCOc1c(OC)ccc2cc(C(=O)NCc3ccc4OCOc4c3)c(=O)oc12
: