Target
Histone-lysine N-methyltransferase EZH2
Ligand
BDBM50017293
Substrate
Meas. Tech.
ChEMBL_1473142 (CHEMBL3417990)
Ki
0.500000±n/a nM
Citation
 Kaniskan, HÜKonze, KDJin, J Selective inhibitors of protein methyltransferases. J Med Chem 58:1596-629 (2015)  
Target
Name:
Histone-lysine N-methyltransferase EZH2
Synonyms:
ENX-1 EZH2_HUMAN Histone-lysine N-methyltransferase EZH2 Lysine N-methyltransferase 6
Type:
Protein
Mol. Mass.:
85367.84
Organism:
Homo sapiens (Human)
Description:
Q15910
Residue:
746
  
Inhibitor
Name:
BDBM50017293
Synonyms:
CHEMBL3287735 | US10647700, Compound GSK126
Type:
Small organic molecule
Emp. Form.:
C31H38N6O2
Mol. Mass.:
526.6724
SMILES:
CC[C@H](C)n1cc(C)c2c(cc(cc12)-c1ccc(nc1)N1CCNCC1)C(=O)NCc1c(C)cc(C)[nH]c1=O
: